Ticket #17650: log.txt

File log.txt, 44.6 KB (added by swt2c, 5 years ago)

Log of compile with webkit.h -> webkit2.h

Line 
1/home/talbert/wxPython/wxWidgets/bk-deps g++ -c -o webviewdll_gtk_webview_webkit.o -I./.pch/wxprec_webviewdll -D__WXGTK__      -DWXBUILDING      -I./src/regex  -DWXUSINGDLL -DWXMAKINGDLL_WEBVIEW -fPIC -DPIC -Wall -Wundef -Wunused-parameter -Wno-ctor-dtor-privacy -Woverloaded-virtual -Wno-deprecated-declarations -D_FILE_OFFSET_BITS=64 -I/home/talbert/wxPython/wxWidgets/lib/wx/include/gtk3-unicode-3.1 -I./include -pthread -I/usr/include/gtk-3.0 -I/usr/include/at-spi2-atk/2.0 -I/usr/include/at-spi-2.0 -I/usr/include/dbus-1.0 -I/usr/lib64/dbus-1.0/include -I/usr/include/gtk-3.0 -I/usr/include/gio-unix-2.0/ -I/usr/include/cairo -I/usr/include/pango-1.0 -I/usr/include/harfbuzz -I/usr/include/pango-1.0 -I/usr/include/atk-1.0 -I/usr/include/cairo -I/usr/include/pixman-1 -I/usr/include/freetype2 -I/usr/include/libpng16 -I/usr/include/freetype2 -I/usr/include/libdrm -I/usr/include/libpng16 -I/usr/include/gdk-pixbuf-2.0 -I/usr/include/libpng16 -I/usr/include/glib-2.0 -I/usr/lib64/glib-2.0/include -pthread -I/usr/include/gstreamer-0.10 -I/usr/include/glib-2.0 -I/usr/lib64/glib-2.0/include -I/usr/include/libxml2 -pthread -I/usr/include/webkitgtk-3.0 -I/usr/include/gtk-3.0 -I/usr/include/at-spi2-atk/2.0 -I/usr/include/at-spi-2.0 -I/usr/include/dbus-1.0 -I/usr/lib64/dbus-1.0/include -I/usr/include/gtk-3.0 -I/usr/include/gio-unix-2.0/ -I/usr/include/cairo -I/usr/include/pango-1.0 -I/usr/include/harfbuzz -I/usr/include/pango-1.0 -I/usr/include/atk-1.0 -I/usr/include/cairo -I/usr/include/pixman-1 -I/usr/include/freetype2 -I/usr/include/libpng16 -I/usr/include/freetype2 -I/usr/include/libdrm -I/usr/include/libpng16 -I/usr/include/gdk-pixbuf-2.0 -I/usr/include/libpng16 -I/usr/include/libsoup-2.4 -I/usr/include/libxml2 -I/usr/include/webkitgtk-3.0 -I/usr/include/glib-2.0 -I/usr/lib64/glib-2.0/include -DWX_PRECOMP -pthread -g -O0 -pthread -I/usr/include/gdk-pixbuf-2.0 -I/usr/include/libpng16 -I/usr/include/glib-2.0 -I/usr/lib64/glib-2.0/include -pthread -I/usr/include/gtk-3.0/unix-print -I/usr/include/gtk-3.0 -I/usr/include/at-spi2-atk/2.0 -I/usr/include/at-spi-2.0 -I/usr/include/dbus-1.0 -I/usr/lib64/dbus-1.0/include -I/usr/include/gtk-3.0 -I/usr/include/gio-unix-2.0/ -I/usr/include/cairo -I/usr/include/pango-1.0 -I/usr/include/harfbuzz -I/usr/include/pango-1.0 -I/usr/include/atk-1.0 -I/usr/include/cairo -I/usr/include/pixman-1 -I/usr/include/freetype2 -I/usr/include/libpng16 -I/usr/include/freetype2 -I/usr/include/libdrm -I/usr/include/libpng16 -I/usr/include/gdk-pixbuf-2.0 -I/usr/include/libpng16 -I/usr/include/glib-2.0 -I/usr/lib64/glib-2.0/include -I/usr/include/SDL -D_GNU_SOURCE=1 -D_REENTRANT -pthread -I/usr/include/libsecret-1 -I/usr/include/glib-2.0 -I/usr/lib64/glib-2.0/include -fvisibility=hidden -fvisibility-inlines-hidden ./src/gtk/webview_webkit.cpp
2./src/gtk/webview_webkit.cpp: In function ‘void wxgtk_webview_webkit_load_status(GtkWidget*, GParamSpec*, wxWebViewWebKit*)’:
3./src/gtk/webview_webkit.cpp:37:5: error: ‘WebKitLoadStatus’ was not declared in this scope
4     WebKitLoadStatus status;
5     ^~~~~~~~~~~~~~~~
6./src/gtk/webview_webkit.cpp:38:52: error: ‘status’ was not declared in this scope
7     g_object_get(G_OBJECT(widget), "load-status", &status, NULL);
8                                                    ^~~~~~
9./src/gtk/webview_webkit.cpp:44:9: error: ‘WebKitWebBackForwardList’ was not declared in this scope
10         WebKitWebBackForwardList* hist = webkit_web_view_get_back_forward_list(WEBKIT_WEB_VIEW(widget));
11         ^~~~~~~~~~~~~~~~~~~~~~~~
12./src/gtk/webview_webkit.cpp:44:35: error: ‘hist’ was not declared in this scope
13         WebKitWebBackForwardList* hist = webkit_web_view_get_back_forward_list(WEBKIT_WEB_VIEW(widget));
14                                   ^~~~
15./src/gtk/webview_webkit.cpp:45:9: error: ‘WebKitWebHistoryItem’ was not declared in this scope
16         WebKitWebHistoryItem* item = webkit_web_back_forward_list_get_current_item(hist);
17         ^~~~~~~~~~~~~~~~~~~~
18./src/gtk/webview_webkit.cpp:45:31: error: ‘item’ was not declared in this scope
19         WebKitWebHistoryItem* item = webkit_web_back_forward_list_get_current_item(hist);
20                               ^~~~
21./src/gtk/webview_webkit.cpp:45:88: error: ‘webkit_web_back_forward_list_get_current_item’ was not declared in this scope
22         WebKitWebHistoryItem* item = webkit_web_back_forward_list_get_current_item(hist);
23                                                                                        ^
24./src/gtk/webview_webkit.cpp:49:53: error: ‘WEBKIT_IS_WEB_HISTORY_ITEM’ was not declared in this scope
25         if(!item || (WEBKIT_IS_WEB_HISTORY_ITEM(item) &&
26                                                     ^
27./src/gtk/webview_webkit.cpp:50:58: error: ‘webkit_web_history_item_get_uri’ was not declared in this scope
28                      webkit_web_history_item_get_uri(item) != url))
29                                                          ^
30./src/gtk/webview_webkit.cpp:53:17: error: ‘newitem’ was not declared in this scope
31                 newitem = webkit_web_history_item_new_with_data
32                 ^~~~~~~
33./src/gtk/webview_webkit.cpp:57:27: error: ‘webkit_web_history_item_new_with_data’ was not declared in this scope
34                           );
35                           ^
36./src/gtk/webview_webkit.cpp:58:64: error: ‘webkit_web_back_forward_list_add_item’ was not declared in this scope
37             webkit_web_back_forward_list_add_item(hist, newitem);
38                                                                ^
39./src/gtk/webview_webkit.cpp: At global scope:
40./src/gtk/webview_webkit.cpp:83:33: error: ‘WebKitWebFrame’ has not been declared
41                                 WebKitWebFrame *frame,
42                                 ^~~~~~~~~~~~~~
43./src/gtk/webview_webkit.cpp:84:33: error: ‘WebKitNetworkRequest’ has not been declared
44                                 WebKitNetworkRequest *request,
45                                 ^~~~~~~~~~~~~~~~~~~~
46./src/gtk/webview_webkit.cpp:85:33: error: ‘WebKitWebNavigationAction’ has not been declared
47                                 WebKitWebNavigationAction *,
48                                 ^~~~~~~~~~~~~~~~~~~~~~~~~
49./src/gtk/webview_webkit.cpp:86:33: error: ‘WebKitWebPolicyDecision’ has not been declared
50                                 WebKitWebPolicyDecision *policy_decision,
51                                 ^~~~~~~~~~~~~~~~~~~~~~~
52./src/gtk/webview_webkit.cpp: In function ‘gboolean wxgtk_webview_webkit_navigation(WebKitWebView*, int*, int*, int*, int*, wxWebViewWebKit*)’:
53./src/gtk/webview_webkit.cpp:89:62: error: ‘webkit_network_request_get_uri’ was not declared in this scope
54     const gchar* uri = webkit_network_request_get_uri(request);
55                                                              ^
56./src/gtk/webview_webkit.cpp:90:55: error: ‘webkit_web_frame_get_name’ was not declared in this scope
57     wxString target = webkit_web_frame_get_name (frame);
58                                                       ^
59./src/gtk/webview_webkit.cpp:105:58: error: ‘webkit_web_policy_decision_ignore’ was not declared in this scope
60         webkit_web_policy_decision_ignore(policy_decision);
61                                                          ^
62./src/gtk/webview_webkit.cpp:115:55: error: ‘webkit_web_policy_decision_use’ was not declared in this scope
63         webkit_web_policy_decision_use(policy_decision);
64                                                       ^
65./src/gtk/webview_webkit.cpp:132:58: error: ‘webkit_web_policy_decision_ignore’ was not declared in this scope
66         webkit_web_policy_decision_ignore(policy_decision);
67                                                          ^
68./src/gtk/webview_webkit.cpp:160:62: error: ‘webkit_web_policy_decision_ignore’ was not declared in this scope
69             webkit_web_policy_decision_ignore(policy_decision);
70                                                              ^
71./src/gtk/webview_webkit.cpp: At global scope:
72./src/gtk/webview_webkit.cpp:169:28: error: ‘WebKitWebFrame’ has not been declared
73                            WebKitWebFrame*,
74                            ^~~~~~~~~~~~~~
75./src/gtk/webview_webkit.cpp:310:33: error: ‘WebKitWebFrame’ has not been declared
76                                 WebKitWebFrame *frame,
77                                 ^~~~~~~~~~~~~~
78./src/gtk/webview_webkit.cpp:311:33: error: ‘WebKitNetworkRequest’ has not been declared
79                                 WebKitNetworkRequest *request,
80                                 ^~~~~~~~~~~~~~~~~~~~
81./src/gtk/webview_webkit.cpp:312:33: error: ‘WebKitWebNavigationAction’ has not been declared
82                                 WebKitWebNavigationAction*,
83                                 ^~~~~~~~~~~~~~~~~~~~~~~~~
84./src/gtk/webview_webkit.cpp:313:33: error: ‘WebKitWebPolicyDecision’ has not been declared
85                                 WebKitWebPolicyDecision *policy_decision,
86                                 ^~~~~~~~~~~~~~~~~~~~~~~
87./src/gtk/webview_webkit.cpp: In function ‘gboolean wxgtk_webview_webkit_new_window(WebKitWebView*, int*, int*, int*, int*, wxWebViewWebKit*)’:
88./src/gtk/webview_webkit.cpp:316:62: error: ‘webkit_network_request_get_uri’ was not declared in this scope
89     const gchar* uri = webkit_network_request_get_uri(request);
90                                                              ^
91./src/gtk/webview_webkit.cpp:318:55: error: ‘webkit_web_frame_get_name’ was not declared in this scope
92     wxString target = webkit_web_frame_get_name (frame);
93                                                       ^
94./src/gtk/webview_webkit.cpp:328:54: error: ‘webkit_web_policy_decision_ignore’ was not declared in this scope
95     webkit_web_policy_decision_ignore(policy_decision);
96                                                      ^
97./src/gtk/webview_webkit.cpp: At global scope:
98./src/gtk/webview_webkit.cpp:334:36: error: ‘WebKitWebFrame’ has not been declared
99                                    WebKitWebFrame*,
100                                    ^~~~~~~~~~~~~~
101./src/gtk/webview_webkit.cpp:351:35: error: ‘WebKitWebFrame’ has not been declared
102                                   WebKitWebFrame *,
103                                   ^~~~~~~~~~~~~~
104./src/gtk/webview_webkit.cpp:353:35: error: ‘WebKitNetworkRequest’ has not been declared
105                                   WebKitNetworkRequest *request,
106                                   ^~~~~~~~~~~~~~~~~~~~
107./src/gtk/webview_webkit.cpp:354:35: error: ‘WebKitNetworkResponse’ has not been declared
108                                   WebKitNetworkResponse *,
109                                   ^~~~~~~~~~~~~~~~~~~~~
110./src/gtk/webview_webkit.cpp: In function ‘void wxgtk_webview_webkit_resource_req(WebKitWebView*, int*, WebKitWebResource*, int*, int*, wxWebViewWebKit*)’:
111./src/gtk/webview_webkit.cpp:357:58: error: ‘webkit_network_request_get_uri’ was not declared in this scope
112     wxString uri = webkit_network_request_get_uri(request);
113                                                          ^
114./src/gtk/webview_webkit.cpp:392:68: error: ‘webkit_network_request_set_uri’ was not declared in this scope
115             webkit_network_request_set_uri(request, path.utf8_str());
116                                                                    ^
117./src/gtk/webview_webkit.cpp: At global scope:
118./src/gtk/webview_webkit.cpp:417:37: error: ‘WebKitWebFrame’ has not been declared
119                                     WebKitWebFrame*,
120                                     ^~~~~~~~~~~~~~
121./src/gtk/webview_webkit.cpp: In member function ‘virtual bool wxWebViewWebKit::Create(wxWindow*, wxWindowID, const wxString&, const wxPoint&, const wxSize&, long int, const wxString&)’:
122./src/gtk/webview_webkit.cpp:499:5: error: ‘WebKitWebBackForwardList’ was not declared in this scope
123     WebKitWebBackForwardList* history;
124     ^~~~~~~~~~~~~~~~~~~~~~~~
125./src/gtk/webview_webkit.cpp:499:31: error: ‘history’ was not declared in this scope
126     WebKitWebBackForwardList* history;
127                               ^~~~~~~
128./src/gtk/webview_webkit.cpp:501:68: error: ‘webkit_web_back_forward_list_get_limit’ was not declared in this scope
129     m_historyLimit = webkit_web_back_forward_list_get_limit(history);
130                                                                    ^
131./src/gtk/webview_webkit.cpp: In member function ‘void wxWebViewWebKit::ZoomIn()’:
132./src/gtk/webview_webkit.cpp:539:39: error: ‘webkit_web_view_zoom_in’ was not declared in this scope
133     webkit_web_view_zoom_in(m_web_view);
134                                       ^
135./src/gtk/webview_webkit.cpp: In member function ‘void wxWebViewWebKit::ZoomOut()’:
136./src/gtk/webview_webkit.cpp:544:40: error: ‘webkit_web_view_zoom_out’ was not declared in this scope
137     webkit_web_view_zoom_out(m_web_view);
138                                        ^
139./src/gtk/webview_webkit.cpp: In member function ‘virtual void wxWebViewWebKit::ClearHistory()’:
140./src/gtk/webview_webkit.cpp:604:5: error: ‘WebKitWebBackForwardList’ was not declared in this scope
141     WebKitWebBackForwardList* history;
142     ^~~~~~~~~~~~~~~~~~~~~~~~
143./src/gtk/webview_webkit.cpp:604:31: error: ‘history’ was not declared in this scope
144     WebKitWebBackForwardList* history;
145                               ^~~~~~~
146./src/gtk/webview_webkit.cpp:606:47: error: ‘webkit_web_back_forward_list_clear’ was not declared in this scope
147     webkit_web_back_forward_list_clear(history);
148                                               ^
149./src/gtk/webview_webkit.cpp: In member function ‘virtual void wxWebViewWebKit::EnableHistory(bool)’:
150./src/gtk/webview_webkit.cpp:611:5: error: ‘WebKitWebBackForwardList’ was not declared in this scope
151     WebKitWebBackForwardList* history;
152     ^~~~~~~~~~~~~~~~~~~~~~~~
153./src/gtk/webview_webkit.cpp:611:31: error: ‘history’ was not declared in this scope
154     WebKitWebBackForwardList* history;
155                               ^~~~~~~
156./src/gtk/webview_webkit.cpp:615:71: error: ‘webkit_web_back_forward_list_set_limit’ was not declared in this scope
157         webkit_web_back_forward_list_set_limit(history, m_historyLimit);
158                                                                       ^
159./src/gtk/webview_webkit.cpp:619:58: error: ‘webkit_web_back_forward_list_set_limit’ was not declared in this scope
160         webkit_web_back_forward_list_set_limit(history, 0);
161                                                          ^
162./src/gtk/webview_webkit.cpp: In member function ‘virtual wxVector<wxSharedPtr<wxWebViewHistoryItem> > wxWebViewWebKit::GetBackwardHistory()’:
163./src/gtk/webview_webkit.cpp:626:5: error: ‘WebKitWebBackForwardList’ was not declared in this scope
164     WebKitWebBackForwardList* history;
165     ^~~~~~~~~~~~~~~~~~~~~~~~
166./src/gtk/webview_webkit.cpp:626:31: error: ‘history’ was not declared in this scope
167     WebKitWebBackForwardList* history;
168                               ^~~~~~~
169./src/gtk/webview_webkit.cpp:629:87: error: ‘webkit_web_back_forward_list_get_back_list_with_limit’ was not declared in this scope
170                                                                         m_historyLimit);
171                                                                                       ^
172./src/gtk/webview_webkit.cpp:633:9: error: ‘WebKitWebHistoryItem’ was not declared in this scope
173         WebKitWebHistoryItem* gtkitem = (WebKitWebHistoryItem*)g_list_nth_data(list, i);
174         ^~~~~~~~~~~~~~~~~~~~
175./src/gtk/webview_webkit.cpp:633:31: error: ‘gtkitem’ was not declared in this scope
176         WebKitWebHistoryItem* gtkitem = (WebKitWebHistoryItem*)g_list_nth_data(list, i);
177                               ^~~~~~~
178./src/gtk/webview_webkit.cpp:633:63: error: expected primary-expression before ‘)’ token
179         WebKitWebHistoryItem* gtkitem = (WebKitWebHistoryItem*)g_list_nth_data(list, i);
180                                                               ^
181./src/gtk/webview_webkit.cpp:635:75: error: ‘webkit_web_history_item_get_uri’ was not declared in this scope
182                                    webkit_web_history_item_get_uri(gtkitem),
183                                                                           ^
184./src/gtk/webview_webkit.cpp:636:77: error: ‘webkit_web_history_item_get_title’ was not declared in this scope
185                                    webkit_web_history_item_get_title(gtkitem));
186                                                                             ^
187./src/gtk/webview_webkit.cpp: In member function ‘virtual wxVector<wxSharedPtr<wxWebViewHistoryItem> > wxWebViewWebKit::GetForwardHistory()’:
188./src/gtk/webview_webkit.cpp:647:5: error: ‘WebKitWebBackForwardList’ was not declared in this scope
189     WebKitWebBackForwardList* history;
190     ^~~~~~~~~~~~~~~~~~~~~~~~
191./src/gtk/webview_webkit.cpp:647:31: error: ‘history’ was not declared in this scope
192     WebKitWebBackForwardList* history;
193                               ^~~~~~~
194./src/gtk/webview_webkit.cpp:650:90: error: ‘webkit_web_back_forward_list_get_forward_list_with_limit’ was not declared in this scope
195                                                                            m_historyLimit);
196                                                                                          ^
197./src/gtk/webview_webkit.cpp:653:9: error: ‘WebKitWebHistoryItem’ was not declared in this scope
198         WebKitWebHistoryItem* gtkitem = (WebKitWebHistoryItem*)g_list_nth_data(list, i);
199         ^~~~~~~~~~~~~~~~~~~~
200./src/gtk/webview_webkit.cpp:653:31: error: ‘gtkitem’ was not declared in this scope
201         WebKitWebHistoryItem* gtkitem = (WebKitWebHistoryItem*)g_list_nth_data(list, i);
202                               ^~~~~~~
203./src/gtk/webview_webkit.cpp:653:63: error: expected primary-expression before ‘)’ token
204         WebKitWebHistoryItem* gtkitem = (WebKitWebHistoryItem*)g_list_nth_data(list, i);
205                                                               ^
206./src/gtk/webview_webkit.cpp:655:75: error: ‘webkit_web_history_item_get_uri’ was not declared in this scope
207                                    webkit_web_history_item_get_uri(gtkitem),
208                                                                           ^
209./src/gtk/webview_webkit.cpp:656:77: error: ‘webkit_web_history_item_get_title’ was not declared in this scope
210                                    webkit_web_history_item_get_title(gtkitem));
211                                                                             ^
212./src/gtk/webview_webkit.cpp: In member function ‘virtual void wxWebViewWebKit::LoadHistoryItem(wxSharedPtr<wxWebViewHistoryItem>)’:
213./src/gtk/webview_webkit.cpp:666:5: error: ‘WebKitWebHistoryItem’ was not declared in this scope
214     WebKitWebHistoryItem* gtkitem = (WebKitWebHistoryItem*)item->m_histItem;
215     ^~~~~~~~~~~~~~~~~~~~
216./src/gtk/webview_webkit.cpp:666:27: error: ‘gtkitem’ was not declared in this scope
217     WebKitWebHistoryItem* gtkitem = (WebKitWebHistoryItem*)item->m_histItem;
218                           ^~~~~~~
219./src/gtk/webview_webkit.cpp:666:59: error: expected primary-expression before ‘)’ token
220     WebKitWebHistoryItem* gtkitem = (WebKitWebHistoryItem*)item->m_histItem;
221                                                           ^
222./src/gtk/webview_webkit.cpp:670:80: error: ‘WEBKIT_WEB_HISTORY_ITEM’ was not declared in this scope
223                                                 WEBKIT_WEB_HISTORY_ITEM(gtkitem));
224                                                                                ^
225./src/gtk/webview_webkit.cpp:670:81: error: ‘webkit_web_view_go_to_back_forward_item’ was not declared in this scope
226                                                 WEBKIT_WEB_HISTORY_ITEM(gtkitem));
227                                                                                 ^
228./src/gtk/webview_webkit.cpp:664:73: warning: unused parameter ‘item’ [-Wunused-parameter]
229 void wxWebViewWebKit::LoadHistoryItem(wxSharedPtr<wxWebViewHistoryItem> item)
230                                                                         ^~~~
231./src/gtk/webview_webkit.cpp: In member function ‘virtual bool wxWebViewWebKit::CanCut() const’:
232./src/gtk/webview_webkit.cpp:676:56: error: ‘webkit_web_view_can_cut_clipboard’ was not declared in this scope
233     return webkit_web_view_can_cut_clipboard(m_web_view);
234                                                        ^
235./src/gtk/webview_webkit.cpp: In member function ‘virtual bool wxWebViewWebKit::CanCopy() const’:
236./src/gtk/webview_webkit.cpp:681:57: error: ‘webkit_web_view_can_copy_clipboard’ was not declared in this scope
237     return webkit_web_view_can_copy_clipboard(m_web_view);
238                                                         ^
239./src/gtk/webview_webkit.cpp: In member function ‘virtual bool wxWebViewWebKit::CanPaste() const’:
240./src/gtk/webview_webkit.cpp:686:58: error: ‘webkit_web_view_can_paste_clipboard’ was not declared in this scope
241     return webkit_web_view_can_paste_clipboard(m_web_view);
242                                                          ^
243./src/gtk/webview_webkit.cpp: In member function ‘virtual void wxWebViewWebKit::Cut()’:
244./src/gtk/webview_webkit.cpp:691:45: error: ‘webkit_web_view_cut_clipboard’ was not declared in this scope
245     webkit_web_view_cut_clipboard(m_web_view);
246                                             ^
247./src/gtk/webview_webkit.cpp: In member function ‘virtual void wxWebViewWebKit::Copy()’:
248./src/gtk/webview_webkit.cpp:696:46: error: ‘webkit_web_view_copy_clipboard’ was not declared in this scope
249     webkit_web_view_copy_clipboard(m_web_view);
250                                              ^
251./src/gtk/webview_webkit.cpp: In member function ‘virtual void wxWebViewWebKit::Paste()’:
252./src/gtk/webview_webkit.cpp:701:47: error: ‘webkit_web_view_paste_clipboard’ was not declared in this scope
253     webkit_web_view_paste_clipboard(m_web_view);
254                                               ^
255./src/gtk/webview_webkit.cpp: In member function ‘virtual bool wxWebViewWebKit::CanUndo() const’:
256./src/gtk/webview_webkit.cpp:706:47: error: ‘webkit_web_view_can_undo’ was not declared in this scope
257     return webkit_web_view_can_undo(m_web_view);
258                                               ^
259./src/gtk/webview_webkit.cpp: In member function ‘virtual bool wxWebViewWebKit::CanRedo() const’:
260./src/gtk/webview_webkit.cpp:711:47: error: ‘webkit_web_view_can_redo’ was not declared in this scope
261     return webkit_web_view_can_redo(m_web_view);
262                                               ^
263./src/gtk/webview_webkit.cpp: In member function ‘virtual void wxWebViewWebKit::Undo()’:
264./src/gtk/webview_webkit.cpp:716:36: error: ‘webkit_web_view_undo’ was not declared in this scope
265     webkit_web_view_undo(m_web_view);
266                                    ^
267./src/gtk/webview_webkit.cpp: In member function ‘virtual void wxWebViewWebKit::Redo()’:
268./src/gtk/webview_webkit.cpp:721:36: error: ‘webkit_web_view_redo’ was not declared in this scope
269     webkit_web_view_redo(m_web_view);
270                                    ^
271./src/gtk/webview_webkit.cpp: In member function ‘virtual wxString wxWebViewWebKit::GetPageSource() const’:
272./src/gtk/webview_webkit.cpp:740:5: error: ‘WebKitWebFrame’ was not declared in this scope
273     WebKitWebFrame* frame = webkit_web_view_get_main_frame(m_web_view);
274     ^~~~~~~~~~~~~~
275./src/gtk/webview_webkit.cpp:740:21: error: ‘frame’ was not declared in this scope
276     WebKitWebFrame* frame = webkit_web_view_get_main_frame(m_web_view);
277                     ^~~~~
278./src/gtk/webview_webkit.cpp:740:70: error: ‘webkit_web_view_get_main_frame’ was not declared in this scope
279     WebKitWebFrame* frame = webkit_web_view_get_main_frame(m_web_view);
280                                                                      ^
281./src/gtk/webview_webkit.cpp:741:5: error: ‘WebKitWebDataSource’ was not declared in this scope
282     WebKitWebDataSource* src = webkit_web_frame_get_data_source (frame);
283     ^~~~~~~~~~~~~~~~~~~
284./src/gtk/webview_webkit.cpp:741:26: error: ‘src’ was not declared in this scope
285     WebKitWebDataSource* src = webkit_web_frame_get_data_source (frame);
286                          ^~~
287./src/gtk/webview_webkit.cpp:741:71: error: ‘webkit_web_frame_get_data_source’ was not declared in this scope
288     WebKitWebDataSource* src = webkit_web_frame_get_data_source (frame);
289                                                                       ^
290./src/gtk/webview_webkit.cpp:746:57: error: ‘webkit_web_data_source_get_data’ was not declared in this scope
291     return wxString(webkit_web_data_source_get_data (src)->str, wxConvUTF8);
292                                                         ^
293./src/gtk/webview_webkit.cpp: In member function ‘virtual void wxWebViewWebKit::SetZoomType(wxWebViewZoomType)’:
294./src/gtk/webview_webkit.cpp:816:56: error: ‘webkit_web_view_set_full_content_zoom’ was not declared in this scope
295                                           TRUE : FALSE));
296                                                        ^
297./src/gtk/webview_webkit.cpp: In member function ‘virtual wxWebViewZoomType wxWebViewWebKit::GetZoomType() const’:
298./src/gtk/webview_webkit.cpp:821:71: error: ‘webkit_web_view_get_full_content_zoom’ was not declared in this scope
299     gboolean fczoom = webkit_web_view_get_full_content_zoom(m_web_view);
300                                                                       ^
301./src/gtk/webview_webkit.cpp: In member function ‘virtual void wxWebViewWebKit::DoSetPage(const wxString&, const wxString&)’:
302./src/gtk/webview_webkit.cpp:839:60: error: ‘webkit_web_view_load_string’ was not declared in this scope
303                                  baseUri.mb_str(wxConvUTF8));
304                                                            ^
305./src/gtk/webview_webkit.cpp: In member function ‘virtual void wxWebViewWebKit::Print()’:
306./src/gtk/webview_webkit.cpp:844:5: error: ‘WebKitWebFrame’ was not declared in this scope
307     WebKitWebFrame* frame = webkit_web_view_get_main_frame(m_web_view);
308     ^~~~~~~~~~~~~~
309./src/gtk/webview_webkit.cpp:844:21: error: ‘frame’ was not declared in this scope
310     WebKitWebFrame* frame = webkit_web_view_get_main_frame(m_web_view);
311                     ^~~~~
312./src/gtk/webview_webkit.cpp:844:70: error: ‘webkit_web_view_get_main_frame’ was not declared in this scope
313     WebKitWebFrame* frame = webkit_web_view_get_main_frame(m_web_view);
314                                                                      ^
315./src/gtk/webview_webkit.cpp:845:34: error: ‘webkit_web_frame_print’ was not declared in this scope
316     webkit_web_frame_print (frame);
317                                  ^
318./src/gtk/webview_webkit.cpp: In member function ‘virtual void wxWebViewWebKit::SetEditable(bool)’:
319./src/gtk/webview_webkit.cpp:884:52: error: ‘webkit_web_view_set_editable’ was not declared in this scope
320     webkit_web_view_set_editable(m_web_view, enable);
321                                                    ^
322./src/gtk/webview_webkit.cpp: In member function ‘virtual bool wxWebViewWebKit::IsEditable() const’:
323./src/gtk/webview_webkit.cpp:889:51: error: ‘webkit_web_view_get_editable’ was not declared in this scope
324     return webkit_web_view_get_editable(m_web_view);
325                                                   ^
326./src/gtk/webview_webkit.cpp: In member function ‘virtual void wxWebViewWebKit::DeleteSelection()’:
327./src/gtk/webview_webkit.cpp:894:48: error: ‘webkit_web_view_delete_selection’ was not declared in this scope
328     webkit_web_view_delete_selection(m_web_view);
329                                                ^
330./src/gtk/webview_webkit.cpp: In member function ‘virtual bool wxWebViewWebKit::HasSelection() const’:
331./src/gtk/webview_webkit.cpp:899:52: error: ‘webkit_web_view_has_selection’ was not declared in this scope
332     return webkit_web_view_has_selection(m_web_view);
333                                                    ^
334./src/gtk/webview_webkit.cpp: In member function ‘virtual void wxWebViewWebKit::SelectAll()’:
335./src/gtk/webview_webkit.cpp:904:42: error: ‘webkit_web_view_select_all’ was not declared in this scope
336     webkit_web_view_select_all(m_web_view);
337                                          ^
338./src/gtk/webview_webkit.cpp: In member function ‘virtual wxString wxWebViewWebKit::GetSelectedText() const’:
339./src/gtk/webview_webkit.cpp:909:5: error: ‘WebKitDOMDocument’ was not declared in this scope
340     WebKitDOMDocument* doc;
341     ^~~~~~~~~~~~~~~~~
342./src/gtk/webview_webkit.cpp:909:24: error: ‘doc’ was not declared in this scope
343     WebKitDOMDocument* doc;
344                        ^~~
345./src/gtk/webview_webkit.cpp:910:5: error: ‘WebKitDOMDOMWindow’ was not declared in this scope
346     WebKitDOMDOMWindow* win;
347     ^~~~~~~~~~~~~~~~~~
348./src/gtk/webview_webkit.cpp:910:25: error: ‘win’ was not declared in this scope
349     WebKitDOMDOMWindow* win;
350                         ^~~
351./src/gtk/webview_webkit.cpp:911:5: error: ‘WebKitDOMDOMSelection’ was not declared in this scope
352     WebKitDOMDOMSelection* sel;
353     ^~~~~~~~~~~~~~~~~~~~~
354./src/gtk/webview_webkit.cpp:911:28: error: ‘sel’ was not declared in this scope
355     WebKitDOMDOMSelection* sel;
356                            ^~~
357./src/gtk/webview_webkit.cpp:912:5: error: ‘WebKitDOMRange’ was not declared in this scope
358     WebKitDOMRange* range;
359     ^~~~~~~~~~~~~~
360./src/gtk/webview_webkit.cpp:912:21: error: ‘range’ was not declared in this scope
361     WebKitDOMRange* range;
362                     ^~~~~
363./src/gtk/webview_webkit.cpp:914:54: error: ‘webkit_web_view_get_dom_document’ was not declared in this scope
364     doc = webkit_web_view_get_dom_document(m_web_view);
365                                                      ^
366./src/gtk/webview_webkit.cpp:915:71: error: ‘WEBKIT_DOM_DOCUMENT’ was not declared in this scope
367     win = webkit_dom_document_get_default_view(WEBKIT_DOM_DOCUMENT(doc));
368                                                                       ^
369./src/gtk/webview_webkit.cpp:915:72: error: ‘webkit_dom_document_get_default_view’ was not declared in this scope
370     win = webkit_dom_document_get_default_view(WEBKIT_DOM_DOCUMENT(doc));
371                                                                        ^
372./src/gtk/webview_webkit.cpp:916:72: error: ‘WEBKIT_DOM_DOM_WINDOW’ was not declared in this scope
373     sel = webkit_dom_dom_window_get_selection(WEBKIT_DOM_DOM_WINDOW(win));
374                                                                        ^
375./src/gtk/webview_webkit.cpp:916:73: error: ‘webkit_dom_dom_window_get_selection’ was not declared in this scope
376     sel = webkit_dom_dom_window_get_selection(WEBKIT_DOM_DOM_WINDOW(win));
377                                                                         ^
378./src/gtk/webview_webkit.cpp:917:79: error: ‘WEBKIT_DOM_DOM_SELECTION’ was not declared in this scope
379     range = webkit_dom_dom_selection_get_range_at(WEBKIT_DOM_DOM_SELECTION(sel),
380                                                                               ^
381./src/gtk/webview_webkit.cpp:918:58: error: ‘webkit_dom_dom_selection_get_range_at’ was not declared in this scope
382                                                   0, NULL);
383                                                          ^
384./src/gtk/webview_webkit.cpp:919:69: error: ‘WEBKIT_DOM_RANGE’ was not declared in this scope
385     return wxString(webkit_dom_range_get_text(WEBKIT_DOM_RANGE(range)),
386                                                                     ^
387./src/gtk/webview_webkit.cpp:919:70: error: ‘webkit_dom_range_get_text’ was not declared in this scope
388     return wxString(webkit_dom_range_get_text(WEBKIT_DOM_RANGE(range)),
389                                                                      ^
390./src/gtk/webview_webkit.cpp: In member function ‘virtual wxString wxWebViewWebKit::GetSelectedSource() const’:
391./src/gtk/webview_webkit.cpp:925:5: error: ‘WebKitDOMDocument’ was not declared in this scope
392     WebKitDOMDocument* doc;
393     ^~~~~~~~~~~~~~~~~
394./src/gtk/webview_webkit.cpp:925:24: error: ‘doc’ was not declared in this scope
395     WebKitDOMDocument* doc;
396                        ^~~
397./src/gtk/webview_webkit.cpp:926:5: error: ‘WebKitDOMDOMWindow’ was not declared in this scope
398     WebKitDOMDOMWindow* win;
399     ^~~~~~~~~~~~~~~~~~
400./src/gtk/webview_webkit.cpp:926:25: error: ‘win’ was not declared in this scope
401     WebKitDOMDOMWindow* win;
402                         ^~~
403./src/gtk/webview_webkit.cpp:927:5: error: ‘WebKitDOMDOMSelection’ was not declared in this scope
404     WebKitDOMDOMSelection* sel;
405     ^~~~~~~~~~~~~~~~~~~~~
406./src/gtk/webview_webkit.cpp:927:28: error: ‘sel’ was not declared in this scope
407     WebKitDOMDOMSelection* sel;
408                            ^~~
409./src/gtk/webview_webkit.cpp:928:5: error: ‘WebKitDOMRange’ was not declared in this scope
410     WebKitDOMRange* range;
411     ^~~~~~~~~~~~~~
412./src/gtk/webview_webkit.cpp:928:21: error: ‘range’ was not declared in this scope
413     WebKitDOMRange* range;
414                     ^~~~~
415./src/gtk/webview_webkit.cpp:929:5: error: ‘WebKitDOMElement’ was not declared in this scope
416     WebKitDOMElement* div;
417     ^~~~~~~~~~~~~~~~
418./src/gtk/webview_webkit.cpp:930:5: error: ‘WebKitDOMDocumentFragment’ was not declared in this scope
419     WebKitDOMDocumentFragment* clone;
420     ^~~~~~~~~~~~~~~~~~~~~~~~~
421./src/gtk/webview_webkit.cpp:931:5: error: ‘WebKitDOMHTMLElement’ was not declared in this scope
422     WebKitDOMHTMLElement* html;
423     ^~~~~~~~~~~~~~~~~~~~
424./src/gtk/webview_webkit.cpp:931:27: error: ‘html’ was not declared in this scope
425     WebKitDOMHTMLElement* html;
426                           ^~~~
427./src/gtk/webview_webkit.cpp:933:54: error: ‘webkit_web_view_get_dom_document’ was not declared in this scope
428     doc = webkit_web_view_get_dom_document(m_web_view);
429                                                      ^
430./src/gtk/webview_webkit.cpp:934:71: error: ‘WEBKIT_DOM_DOCUMENT’ was not declared in this scope
431     win = webkit_dom_document_get_default_view(WEBKIT_DOM_DOCUMENT(doc));
432                                                                       ^
433./src/gtk/webview_webkit.cpp:934:72: error: ‘webkit_dom_document_get_default_view’ was not declared in this scope
434     win = webkit_dom_document_get_default_view(WEBKIT_DOM_DOCUMENT(doc));
435                                                                        ^
436./src/gtk/webview_webkit.cpp:935:72: error: ‘WEBKIT_DOM_DOM_WINDOW’ was not declared in this scope
437     sel = webkit_dom_dom_window_get_selection(WEBKIT_DOM_DOM_WINDOW(win));
438                                                                        ^
439./src/gtk/webview_webkit.cpp:935:73: error: ‘webkit_dom_dom_window_get_selection’ was not declared in this scope
440     sel = webkit_dom_dom_window_get_selection(WEBKIT_DOM_DOM_WINDOW(win));
441                                                                         ^
442./src/gtk/webview_webkit.cpp:936:79: error: ‘WEBKIT_DOM_DOM_SELECTION’ was not declared in this scope
443     range = webkit_dom_dom_selection_get_range_at(WEBKIT_DOM_DOM_SELECTION(sel),
444                                                                               ^
445./src/gtk/webview_webkit.cpp:937:58: error: ‘webkit_dom_dom_selection_get_range_at’ was not declared in this scope
446                                                   0, NULL);
447                                                          ^
448./src/gtk/webview_webkit.cpp:938:83: error: ‘webkit_dom_document_create_element’ was not declared in this scope
449     div = webkit_dom_document_create_element(WEBKIT_DOM_DOCUMENT(doc), "div", NULL);
450                                                                                   ^
451./src/gtk/webview_webkit.cpp:940:67: error: ‘WEBKIT_DOM_RANGE’ was not declared in this scope
452     clone = webkit_dom_range_clone_contents(WEBKIT_DOM_RANGE(range), NULL);
453                                                                   ^
454./src/gtk/webview_webkit.cpp:940:74: error: ‘webkit_dom_range_clone_contents’ was not declared in this scope
455     clone = webkit_dom_range_clone_contents(WEBKIT_DOM_RANGE(range), NULL);
456                                                                          ^
457./src/gtk/webview_webkit.cpp:941:38: error: overloaded function with no contextual type information
458     webkit_dom_node_append_child(&div->parent_instance, &clone->parent_instance, NULL);
459                                      ^~
460./src/gtk/webview_webkit.cpp:941:38: error: base operand of ‘->’ is not a pointer
461./src/gtk/webview_webkit.cpp:941:65: error: request for member ‘parent_instance’ in ‘clone’, which is of non-class type ‘int(int (*)(void*), void*, int, void*, ...) throw ()’
462     webkit_dom_node_append_child(&div->parent_instance, &clone->parent_instance, NULL);
463                                                                 ^~~~~~~~~~~~~~~
464./src/gtk/webview_webkit.cpp:941:86: error: ‘webkit_dom_node_append_child’ was not declared in this scope
465     webkit_dom_node_append_child(&div->parent_instance, &clone->parent_instance, NULL);
466                                                                                      ^
467./src/gtk/webview_webkit.cpp:942:34: error: expected primary-expression before ‘)’ token
468     html = (WebKitDOMHTMLElement*)div;
469                                  ^
470./src/gtk/webview_webkit.cpp:944:88: error: ‘WEBKIT_DOM_HTML_ELEMENT’ was not declared in this scope
471     return wxString(webkit_dom_html_element_get_inner_html(WEBKIT_DOM_HTML_ELEMENT(html)),
472                                                                                        ^
473./src/gtk/webview_webkit.cpp:944:89: error: ‘webkit_dom_html_element_get_inner_html’ was not declared in this scope
474     return wxString(webkit_dom_html_element_get_inner_html(WEBKIT_DOM_HTML_ELEMENT(html)),
475                                                                                         ^
476./src/gtk/webview_webkit.cpp: In member function ‘virtual void wxWebViewWebKit::ClearSelection()’:
477./src/gtk/webview_webkit.cpp:950:5: error: ‘WebKitDOMDocument’ was not declared in this scope
478     WebKitDOMDocument* doc;
479     ^~~~~~~~~~~~~~~~~
480./src/gtk/webview_webkit.cpp:950:24: error: ‘doc’ was not declared in this scope
481     WebKitDOMDocument* doc;
482                        ^~~
483./src/gtk/webview_webkit.cpp:951:5: error: ‘WebKitDOMDOMWindow’ was not declared in this scope
484     WebKitDOMDOMWindow* win;
485     ^~~~~~~~~~~~~~~~~~
486./src/gtk/webview_webkit.cpp:951:25: error: ‘win’ was not declared in this scope
487     WebKitDOMDOMWindow* win;
488                         ^~~
489./src/gtk/webview_webkit.cpp:952:5: error: ‘WebKitDOMDOMSelection’ was not declared in this scope
490     WebKitDOMDOMSelection* sel;
491     ^~~~~~~~~~~~~~~~~~~~~
492./src/gtk/webview_webkit.cpp:952:28: error: ‘sel’ was not declared in this scope
493     WebKitDOMDOMSelection* sel;
494                            ^~~
495./src/gtk/webview_webkit.cpp:954:54: error: ‘webkit_web_view_get_dom_document’ was not declared in this scope
496     doc = webkit_web_view_get_dom_document(m_web_view);
497                                                      ^
498./src/gtk/webview_webkit.cpp:955:71: error: ‘WEBKIT_DOM_DOCUMENT’ was not declared in this scope
499     win = webkit_dom_document_get_default_view(WEBKIT_DOM_DOCUMENT(doc));
500                                                                       ^
501./src/gtk/webview_webkit.cpp:955:72: error: ‘webkit_dom_document_get_default_view’ was not declared in this scope
502     win = webkit_dom_document_get_default_view(WEBKIT_DOM_DOCUMENT(doc));
503                                                                        ^
504./src/gtk/webview_webkit.cpp:956:72: error: ‘WEBKIT_DOM_DOM_WINDOW’ was not declared in this scope
505     sel = webkit_dom_dom_window_get_selection(WEBKIT_DOM_DOM_WINDOW(win));
506                                                                        ^
507./src/gtk/webview_webkit.cpp:956:73: error: ‘webkit_dom_dom_window_get_selection’ was not declared in this scope
508     sel = webkit_dom_dom_window_get_selection(WEBKIT_DOM_DOM_WINDOW(win));
509                                                                         ^
510./src/gtk/webview_webkit.cpp:957:76: error: ‘WEBKIT_DOM_DOM_SELECTION’ was not declared in this scope
511     webkit_dom_dom_selection_remove_all_ranges(WEBKIT_DOM_DOM_SELECTION(sel));
512                                                                            ^
513./src/gtk/webview_webkit.cpp:957:77: error: ‘webkit_dom_dom_selection_remove_all_ranges’ was not declared in this scope
514     webkit_dom_dom_selection_remove_all_ranges(WEBKIT_DOM_DOM_SELECTION(sel));
515                                                                             ^
516./src/gtk/webview_webkit.cpp: In member function ‘virtual wxString wxWebViewWebKit::GetPageText() const’:
517./src/gtk/webview_webkit.cpp:963:5: error: ‘WebKitDOMDocument’ was not declared in this scope
518     WebKitDOMDocument* doc;
519     ^~~~~~~~~~~~~~~~~
520./src/gtk/webview_webkit.cpp:963:24: error: ‘doc’ was not declared in this scope
521     WebKitDOMDocument* doc;
522                        ^~~
523./src/gtk/webview_webkit.cpp:964:5: error: ‘WebKitDOMHTMLElement’ was not declared in this scope
524     WebKitDOMHTMLElement* body;
525     ^~~~~~~~~~~~~~~~~~~~
526./src/gtk/webview_webkit.cpp:964:27: error: ‘body’ was not declared in this scope
527     WebKitDOMHTMLElement* body;
528                           ^~~~
529./src/gtk/webview_webkit.cpp:966:54: error: ‘webkit_web_view_get_dom_document’ was not declared in this scope
530     doc = webkit_web_view_get_dom_document(m_web_view);
531                                                      ^
532./src/gtk/webview_webkit.cpp:967:64: error: ‘WEBKIT_DOM_DOCUMENT’ was not declared in this scope
533     body = webkit_dom_document_get_body(WEBKIT_DOM_DOCUMENT(doc));
534                                                                ^
535./src/gtk/webview_webkit.cpp:967:65: error: ‘webkit_dom_document_get_body’ was not declared in this scope
536     body = webkit_dom_document_get_body(WEBKIT_DOM_DOCUMENT(doc));
537                                                                 ^
538./src/gtk/webview_webkit.cpp:968:88: error: ‘WEBKIT_DOM_HTML_ELEMENT’ was not declared in this scope
539     return wxString(webkit_dom_html_element_get_inner_text(WEBKIT_DOM_HTML_ELEMENT(body)),
540                                                                                        ^
541./src/gtk/webview_webkit.cpp:968:89: error: ‘webkit_dom_html_element_get_inner_text’ was not declared in this scope
542     return wxString(webkit_dom_html_element_get_inner_text(WEBKIT_DOM_HTML_ELEMENT(body)),
543                                                                                         ^
544./src/gtk/webview_webkit.cpp: In member function ‘virtual void wxWebViewWebKit::RunScript(const wxString&)’:
545./src/gtk/webview_webkit.cpp:975:65: error: ‘webkit_web_view_execute_script’ was not declared in this scope
546                                    javascript.mb_str(wxConvUTF8));
547                                                                 ^
548./src/gtk/webview_webkit.cpp: In member function ‘virtual long int wxWebViewWebKit::Find(const wxString&, int)’:
549./src/gtk/webview_webkit.cpp:1000:55: error: ‘webkit_web_view_unmark_text_matches’ was not declared in this scope
550         webkit_web_view_unmark_text_matches(m_web_view);
551                                                       ^
552./src/gtk/webview_webkit.cpp:1001:69: error: ‘webkit_web_view_set_highlight_text_matches’ was not declared in this scope
553         webkit_web_view_set_highlight_text_matches(m_web_view, false);
554                                                                     ^
555./src/gtk/webview_webkit.cpp:1010:55: error: ‘webkit_web_view_unmark_text_matches’ was not declared in this scope
556         webkit_web_view_unmark_text_matches(m_web_view);
557                                                       ^
558./src/gtk/webview_webkit.cpp:1011:69: error: ‘webkit_web_view_set_highlight_text_matches’ was not declared in this scope
559         webkit_web_view_set_highlight_text_matches(m_web_view, false);
560                                                                     ^
561./src/gtk/webview_webkit.cpp:1027:99: error: ‘webkit_web_view_mark_text_matches’ was not declared in this scope
562         m_findCount = webkit_web_view_mark_text_matches(m_web_view, wxGTK_CONV(text), matchCase, 0);
563                                                                                                   ^
564./src/gtk/webview_webkit.cpp:1046:69: error: ‘webkit_web_view_set_highlight_text_matches’ was not declared in this scope
565     webkit_web_view_set_highlight_text_matches(m_web_view, highlight);
566                                                                     ^
567./src/gtk/webview_webkit.cpp:1048:91: error: ‘webkit_web_view_search_text’ was not declared in this scope
568     if(!webkit_web_view_search_text(m_web_view, wxGTK_CONV(text), matchCase, forward, wrap))
569                                                                                           ^
570Makefile:34342: recipe for target 'webviewdll_gtk_webview_webkit.o' failed
571make: *** [webviewdll_gtk_webview_webkit.o] Error 1